d1_pc1,pri_care_fm2___2,principal_caregiverpc2_complete,d10_2_pc2,d10_2_pc3,pri_care_inf_fm3___2,pri_care_inf_fm4___2,pri_care_inf_fm5___2,pri_care_inf_fm6___2,a4_fm1_religion,a5_fm1_education,a6_fm1_occupation,a6_2_fm1_others,a7_fm1_income,a8_2_fm1_others,basic_information_fm1_complete,basic_information_fm2_timestamp,a1_fm2,a2_fm2,a3_fm2,a4_fm2,a7_fm2,a8_2_fm2,inj_hist_fm2,illness_hist_fm2,basic_information_fm2_complete,basic_information_fm3_timestamp,a1_fm3,a2_fm3,a3_fm3,a4_fm3,a7_fm3,a8_2_fm3,inj_hist_fm3,illness_hist_fm3,basic_information_fm3_complete,basic_information_fm4_timestamp,a1_fm4,a2_fm4,a3_fm4,a4_fm4,a7_fm4,a8_2_fm4,inj_hist_fm4,illness_hist_fm4,basic_information_fm4_complete,basic_information_fm5_timestamp,a1_fm5,a2_fm5,a3_fm5,a4_fm5,a7_fm5,inj_hist_fm5,illness_hist_fm5,basic_information_fm5_complete,basic_information_fm6_timestamp,a1_fm6,a2_fm6,a3_fm6,a4_fm6,a7_fm6,basic_information_fm6_complete,basic_information_fm7_timestamp,a1_fm7,a2_fm7,a3_fm7,a4_fm7,a5_fm7,a6_fm7,a6_2_fm7,a7_fm7,a8_fm7,a8_2_fm7,basic_information_fm7_complete,basic_information_fm8_timestamp,a1_fm8,a2_fm8,a3_fm8,a4_fm8,a5_fm8,a6_fm8,a6_2_fm8,a7_fm8,a8_fm8,a8_2_fm8,basic_information_fm8_complete,basic_information_fm9_timestamp,a1_fm9,a2_fm9,a3_fm9,a4_fm9,a5_fm9,a6_fm9,a6_2_fm9,a7_fm9,a8_fm9,a8_2_fm9,basic_information_fm9_complete,basic_information_fm10_timestamp,a1_fm10,a2_fm10,a3_fm10,a4_fm10,a5_fm10,a6_fm10,a6_2fm10,a7_fm10,a8_fm10,a8_2_fm10,basic_information_fm10_complete,injury_historyfm1_timestamp,unique_id_no_illh,b1_fm1_Index_ChildID,b2_fm1,b3_fm1_Injury_mechanism,b4_fm1_place_of_injury,b4_fm6,b4_2_fm1,b6_fm1_accompanying_person,b6_2_fm6,injury_historyfm1_complete,injury_historyfm2_timestamp,b1_fm2,b2_fm2,b3_fm2,b4_fm2,b4_2_fm2,b5_fm2,b6_fm2,b6_2_fm2,injury_historyfm2_complete,injury_historyfm3_timestamp,b1_fm3,b2_fm3,b3_fm3,b4_fm3,b4_2_fm3,b5_fm3,b6_fm3,b6_2_fm3,injury_historyfm3_complete,injury_historyfm4_timestamp,b1_fm4,b2_fm4,b3_fm4,b4_fm4,b4_2_fm4,b5_fm4,b6_fm4,b6_2_fm4,injury_historyfm4_complete,injury_historyfm5_timestamp,b1_fm5,b2_fm5,b3_fm5,b4_fm5,b4_2_fm5,b5_fm5,b6_fm5,b6_2_fm5,injury_historyfm5_complete,illness_historyfm1_timestamp,c1_fm1,c2_fm1_fever,c3_fm1_commoncold,c4_fm1_diarrhoea,c5_fm1_jaundice,c6_fm1_fever_with_rash,illness_historyfm1_complete,illness_historyfm2_timestamp,c1_fm2,c2_fm2,c3_fm2,c4_fm2,c5_fm2,c6_fm2,illness_historyfm2_complete,illness_historyfm3_timestamp,c1_fm3,c2_fm3,c3_fm3,c4_fm3,c5_fm3,c6_fm3,illness_historyfm3_complete,illness_historyfm4_timestamp,c1_fm4,c2_fm4,c3_fm4,c4_fm4,c5_fm4,c6_fm4,illness_historyfm4_complete,illness_historyfm5_timestamp,c1_fm5,c2_fm5,c3_fm5,c4_fm5,c5_fm5,c6_fm5,illness_historyfm5_complete,principal_caregiverpc2_timestamp,d3_pc1_relation_with_child,d3_2_pc1,d5_pc1___1_working_days,d5_pc1___2,d5_pc1___3,d5_pc1___4,d5_pc1___5,d5_pc1___6,d5_pc1___7,d6_pc1_working_hour,d7_pc1_missing_workingday,hh_no_A,d10_2_pc1,principal_caregiverpc3_timestamp,d1_pc2,d3_pc2,d3_2_pc2,d5_pc2___1,d5_pc2___2,d5_pc2___3,d5_pc2___4,d5_pc2___5,d5_pc2___6,d5_pc2___7,d6_pc2,d7_pc2,principal_caregiverpc3_complete,principal_caregiverpc4_timestamp,d1_pc3,d3_pc3,d5_pc3___1,d5_pc3___2,d5_pc3___3,d5_pc3___4,d5_pc3___5,d5_pc3___6,d5_pc3___7,d6_pc3,d7_pc3,principal_caregiverpc4_complete,principal_caregiverpc5_timestamp,d1_pc4,d3_pc4,d5_pc4___1,d5_pc4___2,d5_pc4___3,d5_pc4___4,d5_pc4___5,d5_pc4___6,d5_pc4___7,d6_pc4,d7_pc4,principal_caregiverpc5_complete,anchal_information_timestamp,unique_id_no_p3,e1_p3_time_of_living_at_that_pla,e2_p3_plan_to_live_howlong,e5_p3___1_which_days_need_help,e5_p3___2,e5_p3___3,e5_p3___4,e5_p3___5,e5_p3___6,e5_p3___7,e6_p3_which_time_need_help,e8_p3_IF_NO_REASON,e8_ext_Others,number_children_send,e9_p3_how_many_child_can_be_admi,e10_p3_minimum_suitable_age,e11_p3___1_which_days_are_convin,e11_p3___2,e11_p3___3,e11_p3___4,e11_p3___5,e11_p3___6,e11_p3___7,e11_p3___97,e11_p3___98,time_daycare,e12_p3_which_time_they_can_go_to,place_demand,e13_p3_Which_place_is_good_to_es,e13_b,e14_p3_willing_to_give_food,e15_p3_if_yes_fees,e16_p3_if_food_from_dcc_then_fee,pay_With_food,fees_without_food,willingness_to_pay,e18_p3_Willingness_to_keep_with_,e19_p3_willing_to_attend_guardia,f1_p3_others_will_use_DCC,f2_p3___1_ifyes_who,f2_p3___2,f2_p3___3,f2_p3___4,f2_p3___5,f2_p3___6,f2_p3___7,f2_p3___8,f2_p3___97,f2_p3___98,middle_class,aware_parents,everyone,f2_p3___99,f2_b_others,f3_p3___1_challenges_inestablish,f3_p3___2,f3_p3___3,f3_p3___4,f3_p3___5,f3_p3___6,f3_p3___7,f3_p3___97,f3_p3___98,f3_p3___99,f3_b_others,g1_b,h2_p3_if_yes_who,h2_b,h3_p3_whos_child,h4_p3_age_of_that_child,h5_p3_which_days_she_lookafter_t,h6_p3,end_date_time_hh,anchal_information_complete,Injury_sts,d4_pc2,d4_pc3,d4_pc4,a6_fm2,a6_2_fm2,a6_fm3,a6_2_fm3,a6_fm4,a6_2_fm4,a6_fm5,a6_2_fm5,a6_fm6,e4_p3_need_help_of_others,pcg_work,d10_pc1_whos_other_CG,d10_pc2,d10_pc3,d10_2_pc4,pri_care_fm2___1,pri_care_inf_fm3___1,pri_care_inf_fm4___1,pri_care_inf_fm5___1,pri_care_inf_fm6___1,opccu_pcg_fm2,opccu_pcg_fm3,opccu_pcg_fm4,opccu_pcg_fm5,opccu_pcg_fm6,d9_pc2,d9_pc1_need_other_CG,d9_pc3,d9_pc4,d10_pc4,fees_if_no_food,fees_if_food,d8_pc1_unability_to_work,d8_pc2,d8_pc3,d8_pc4,necessity_yes,willing_to_pay_100,willing_to_pay_50,e3_p3_feel_thenecessityofDCC,e7_p3_willing_to_admit_in_DCC,e17_p3_willing_to_give_extra_mon,willing_to_pay_any,Type_HH,HH_type,VAR00001,slumnonslum_injured,slumnonslum_illness,silvia_Occupation_PCG,Injury,Illness,Education_PCG,cluster,rec_need_scg,binary_edu_pcg,regress_occu_pcg,a9_fm1_height,height_meter,a10_fm1_weight,height_meter_square,occu_pcg,new_reg_occu_pcg,regress_pc_work_edit,d4_pc1_working_or_not,VAR00003,unique_id_no_ih,regre_HH_type,subpop_slum,subpop_nonslum,new_reg_edu_pcg,subpop_pc_literate,subpop_pc_illiterate,occu_type_pcg,new_occu_type_pcg,VAR00004,VAR00005,subpop_pc_skilled,subpop_pc_unskilled,housewife_or_student,new_working_pcg,subpop_pcg_work,subpop_pcg_not_work,merged_inability_takework_pcg,subpop_missed_work,subpop_not_missed_work,a2_fm1_AGE,regress_age_index_child,new_reg_age,subpop_age_more,subpop_age_less,a3_fm1_gender,male_child,female_child,bmi,Zbmi,regress_injury,injured,not_injured,regress_illness,ill,not_ill,regress_need_of_scg,subpop_need_scg,subpop_only_pcg,binary_need_dcc,binary_willint_admit,binary_willing_pay,binary_extra_pay,ZSco01,zscore_cat,filter__,h1_p3_lookafter_child_of_otherHH,g1_p3,unique_id_no_pc,unique_id_no,date_time_dc,end_date_time,duration
2,0,2, , ,no,,,,1,0,0,,0,,2,,2,20,2,1,0, ,3,3,2,,3,25,1,1,10000, ,3,3,2,,,,,,, ,,,,,,,,,,,,,,,,,,,,,,,,,,, ,,, ,0,,,,,,,, ,,,,0,,,,,,,, ,,, ,0,,,,,,,, ,,, ,0,,111322301,,,,,,,, ,0,,,,,,,,, ,0,,,,,,,,,,0,,,,,,,,,,0,,,,,,,,,,0,,1,1,1,2,2,2,2,,,,,,,,0,,,,,,,,0,,,,,,,,0,,,,,,,,0,,1, ,0,0,0,0,0,0,0, ,,223,,,,,,0,0,0,0,0,0,0,,,0,,,,0,0,0,0,0,0,0,,,0,,,,0,0,0,0,0,0,0,,,0,,111322301,3,97,0,0,0,0,0,0,0, ,no response, ,,,,,,,,,,,, ,, ,, , , ,0,0,,,no,don't know,no,don't know,0,0,0,0,0,0,0,0,0,0,,,,0, ,0,0,0,0,0,0,0,yes,0,0, , ,,, ,,,,42942.53125,2,0,,,,housewife, ,private job, ,, ,, ,,2,,, , , ,yes,no,,,,housewife,,,,,,yes-unpaid,,,,0,0,no,,,,,,,no,no,don't know,,non-slum,non-slum,,,nonslum ill,housewife/not working,no,yes,Primary,3,yes-unpaid,illiterate or upto primary,housewife/notworking,104,1.04,13,1.0816,housewife,housewife or unskilled,no,no,,111322301,non-slum,no,yes,literate,yes,no,housewife/student,,,,no,no,yes,no,no,yes,no,,yes,4,3.5 years or older,3.5 or more,yes,no,female,no,yes,12.01923076923077,-1.570877506500634,no,no,yes,yes,yes,no,yes,yes,no,no,no,no,,-1.570877506500634,-2 to < -1,Selected,no,Ward councillor,111322301,111322301,26 Jul 17,26 Jul 17,14
2,0,2, , ,no,no,,,1,0,0,,0,,2,,2,24,2,1,2000, ,3,3,2,,3,5,1,1,0, ,3,3,2,,4,26,1,1,15000, ,3,3,2,,,,,,,,,,,,,,,,,,,,,,,, ,,, ,0,,,,,,,, ,,,,0,,,,,,,, ,,, ,0,,,,,,,, ,,, ,0,,111100701,,,,,,,, ,0,,,,,,,,, ,0,,,,,,,,,,0,,,,,,,,,,0,,,,,,,,,,0,,1,1,2,1,2,2,2,,,,,,,,0,,,,,,,,0,,,,,,,,0,,,,,,,,0,,1, ,0,0,0,0,0,0,0, ,,7,,,,,,0,0,0,0,0,0,0,,,0,,,,0,0,0,0,0,0,0,,,0,,,,0,0,0,0,0,0,0,,,0,,111100701,3,1,1,1,1,1,1,1,1,12.00pm-5.00pm,don't know, ,,,,,,,,,,,, ,, ,, , ,1,500,800,1,1,yes,no,yes,yes,0,0,0,0,0,0,0,0,yes,0,,,,0, ,0,0,0,0,0,0,0,yes,0,0, , ,,, ,,,,42939.69097222222,2,0,,,,work from home, ,not applicable, ,rickshaw puller,Rick Shaw puller,, ,,1,,, , , ,yes,no,no,,,work from home,,,,,,yes-unpaid,,,,500,800,no,,,,,1,1,no,no,yes,yes,slum,slum,,,slum ill,Unskilled,no,yes,Illiterate,1,yes-unpaid,,unskilled worker,90,.9,9.9,.8100000000000001,work from home,housewife or unskilled,no,no,,111100701,slum,yes,no,illiterate,no,yes,unskilled worker,,,,no,yes,no,yes,yes,no,no,,yes,2.5,Less than 3.5 years old,1 to less than 3.5 years,no,yes,male,yes,no,12.22222222222222,-1.448409952391649,no,no,yes,yes,yes,no,yes,yes,no,no,no,yes,yes,-1.448409952391649,-2 to < -1,Selected,no,Ward councillor,111100701,111100701,23 Jul 17,23 Jul 17,37
2,0,2, , ,no,no,,,1,0,0,,0,,2,,2,12,2,1,0,Khala,3,3,2,,3,19,2,1,7000, ,3,3,2,,4,13,2,1,5000,Khala,3,3,2,,,,,,,,,,,,,,,,,,,,,,,, ,,, ,0,,,,,,,, ,,,,0,,,,,,,, ,,, ,0,,,,,,,, ,,, ,0,,111321201,,,,,,,, ,0,,,,,,,,, ,0,,,,,,,,,,0,,,,,,,,,,0,,,,,,,,,,0,,1,1,1,1,2,2,2,,,,,,,,0,,,,,,,,0,,,,,,,,0,,,,,,,,0,,99,Khala,0,0,0,0,0,0,0, ,,212,,,,,,0,0,0,0,0,0,0,,,2,,,,0,0,0,0,0,0,0,,,0,,,,0,0,0,0,0,0,0,,,0,,111321201,3,3,1,1,1,1,1,1,1,12.00pm-14.00pm,don't know, ,,,,,,,,,,,, ,, ,, , ,1,100,300,1,1,yes,yes,no,yes,yes,0,0,0,0,0,0,0,0,0,,,,0, ,0,yes,0,0,0,0,0,0,0,0, , ,,, ,,,,42940.4875,2,0,,,,unemployed, ,recycling, ,other skilled laborer,batery factory,, ,,1,,, , , ,yes,no,no,,,unemployed,,,,,,yes-unpaid,,,,100,300,no,,,,yes,1,1,yes,no,no,yes,slum,slum,,,slum ill,housewife/not working,no,yes,Primary,3,yes-unpaid,illiterate or upto primary,housewife/notworking,84,.84,10,.7055999999999999,unemployed,housewife or unskilled,no,no,,111321201,slum,yes,no,literate,yes,no,housewife/student,,,,no,no,yes,no,no,yes,no,,yes,3,Less than 3.5 years old,1 to less than 3.5 years,no,yes,male,yes,no,14.17233560090703,-.2718795507259493,no,no,yes,yes,yes,no,yes,yes,no,yes,no,yes,no,-.2718795507259493,-1 to +1,Selected,no,Ward councillor,111321201,111321201,24 Jul 17,24 Jul 17,22
2,0,2, , ,no,,,,1,0,0,,0,,2,,2,19,2,1,0, ,3,3,2,,3,25,1,1,50000, ,3,3,2,,,,,,, ,,,,,,,,,,,,,,,,,,,,,,,,,,, ,,, ,0,,,,,,,, ,,,,0,,,,,,,, ,,, ,0,,,,,,,, ,,, ,0,,111102801,,,,,,,, ,0,,,,,,,,, ,0,,,,,,,,,,0,,,,,,,,,,0,,,,,,,,,,0,,1,,,,,,0,,,,,,,,0,,,,,,,,0,,,,,,,,0,,,,,,,,0,,1, ,0,0,0,0,0,0,0, ,,28,,,,,,0,0,0,0,0,0,0,,,0,,,,0,0,0,0,0,0,0,,,0,,,,0,0,0,0,0,0,0,,,0,,111102801,3,3,0,0,0,0,0,0,0, ,disabled child,Special child (physically disabled),,,,,,,,,,,, ,, ,, , , ,0,0,,,no,no response,no response,yes,yes,0,0,0,0,0,yes,0,0,0,,,,0, ,0,0,0,0,0,0,yes,0,0,0, , ,,, ,,,,42946.41111111111,2,0,,,,housewife, ,business, ,, ,, ,,2,,, , , ,yes,no,,,,housewife,,,,,,no,,,,0,0,no,,,,yes,,,yes,no,refused to answer,,non-slum,non-slum,,,,housewife/not working,no,no,Secondary,1,no,illiterate or upto primary,housewife/notworking,81,.8100000000000001,8.800000000000001,.6561000000000001,housewife,housewife or unskilled,no,no,,111102801,non-slum,no,yes,literate,yes,no,housewife/student,,,,no,no,yes,no,no,yes,no,,yes,2.5,Less than 3.5 years old,1 to less than 3.5 years,no,yes,female,no,yes,13.41258954427679,-.7302448657590431,no,no,yes,no,no,yes,no,no,yes,yes,no,no,,-.7302448657590431,-1 to +1,Selected,no,Ward councillor,111102801,111102801,30 Jul 17,30 Jul 17,22
2,0,2, , ,no,no,no,no,1,0,0,,0,,2,,2,28,2,1,0, ,3,3,2,,3,6,2,1,0, ,3,3,2,,4,9,1,1,0, ,3,3,2,,5,13,1,1,0,3,3,2,,6,40,1,1,25000,2,,,,,,,, ,,, ,0,,,,,,,, ,,,,0,,,,,,,, ,,, ,0,,,,,,,, ,,, ,0,,111324301,,,,,,,, ,0,,,,,,,,, ,0,,,,,,,,,,0,,,,,,,,,,0,,,,,,,,,,0,,,,,,,,0,,,,,,,,0,,,,,,,,0,,,,,,,,0,,,,,,,,0,,1, ,0,0,0,0,0,0,0, ,,243,,,,,,0,0,0,0,0,0,0,,,0,,,,0,0,0,0,0,0,0,,,0,,,,0,0,0,0,0,0,0,,,0,,111324301,3,3,0,0,0,0,0,0,0, ,unable to pickup and drop off,Baccha newa kora somossa,,,,,,,,,,,, ,, ,, , ,1,250,300,1,1,yes,yes,no,yes,yes,0,0,0,0,0,yes,0,0,0,,,,0, ,0,0,0,0,0,0,0,yes,0,0, ,Political leader / zahir,,, ,,,,42947.65208333333,2,0,,,,housewife, ,not applicable, ,not applicable, ,not applicable, ,business,2,,, , , ,yes,no,no,no,no,housewife,,,,,,no,,,,250,300,no,,,,,1,1,no,no,yes,yes,non-slum,non-slum,,,,housewife/not working,no,no,Primary,3,no,illiterate or upto primary,housewife/notworking,98,.98,11.5,.9603999999999999,housewife,housewife or unskilled,no,no,,111324301,non-slum,no,yes,literate,yes,no,housewife/student,,,,no,no,yes,no,no,yes,no,,yes,4.5,3.5 years or older,3.5 or more,yes,no,male,yes,no,11.97417742607247,-1.598058812214338,no,no,yes,no,no,yes,no,no,yes,no,no,yes,yes,-1.598058812214338,-2 to < -1,Selected,no,local political leaders,111324301,111324301,31 Jul 17,31 Jul 17,29
1,1,,2,0,yes,no,no,no,1,0,0,,0,,2,,2,4.5,2,1,0, ,2,2,2,,3,35,2,1,0, ,3,3,2,,4,42,1,1,70000, ,3,3,2,,5,14,2,1,0,3,3,2,,6,12,2,1,0,2,,7,10,1,1,2,99,Student,0,4, ,2,,8,9,1,1,2,99,Student,0,9,,2,,9,38,1,1,5,11, ,0,7, ,2,,10,27,2,1,12,8, ,0,8, ,2,,111515801,,,,,,,, ,0,,,,,,,,, ,0,,,,,,,,,,0,,,,,,,,,,0,,,,,,,,,,0,,,,,,,,0,,,,,,,,0,,,,,,,,0,,,,,,,,0,,,,,,,,0,,,2.0,0,0,0,0,0,0,, ,2, ,0,3,1,,2,0,0,0,0,0,0,,,2,,,,,0,0,0,0,0,0,,,,,,,,0,0,0,0,0,0,,,,,111515801,3,3,1,0,0,0,0,0,0, ,2,do not feel necessary,Mother is enough to take care of ch,,97,1,1,1,1,1,0,1,0,0,0,from morning till night,8.00am-20.00pm,, ,98,0,0,97,,,no,don't know,yes,yes,0,0,0,0,0,0,0,0,0,0,,,,,0,0,0,0,0,0,yes,0,0,0,, ,2,,, ,,,06 Aug 17,2,,0,0,0,0,not applicable, ,housewife, ,business, ,student,Student,I don't know,0,yes,,Projojjo noy, ,0,no,yes,no,no,no,,housewife,,,,no,others,,,,0,97,,,,,,,1,no,no,don't know,yes,non-slum,non-slum,,,,housewife/not working,no,no,HSC and above,5,no,secondary and above,housewife/notworking,93,.9300000000000001,14.1,.8649000000000001,housewife,housewife or unskilled,no,yes,,111515801,non-slum,no,yes,literate,yes,no,housewife/student,,,,no,no,yes,no,no,yes,,,,4,3.5 years or older,3.5 or more,yes,no,male,yes,no,16.3024627124523,1.013255628355563,no,no,yes,no,no,yes,no,no,yes,no,no,yes,,1.013255628355563,> +1 to +2,Selected,999,don't know,111515801,111515801,06 Aug 17,06 Aug 17,28
2,0,,0,0,no,no,no,yes,1,0,0,,0,,2,,2,28,2,1,0, ,3,3,2,,3,10,2,1,0, ,2,2,2,,4,13,1,1,0, ,3,3,2,,5,40,1,1,10000,3,3,2,,,,,,,0,,,,,,,, ,,, ,0,,,,,,,, ,,,,0,,,,,,,, ,,, ,0,,,,,,,, ,,, ,0,,111627001,,,,,,,, ,0,,,,,,,,, ,0,,,,,,,,,,0,,,,,,,,,,0,,,,,,,,,,0,,,,,,,,0,,,,,,,,0,,,,,,,,0,,,,,,,,0,,,,,,,,0,,1, ,0,0,0,0,0,0,0, ,, ,2,,,,,0,0,0,0,0,0,,,,,,,,0,0,0,0,0,0,,,,,,,,0,0,0,0,0,0,,,,,111627001,3,,2,0,0,0,0,0,0, ,2,do not feel necessary,Basai sob sikhte pare o dakhar lok,,98,0,0,0,0,0,0,0,0,1,Don't know,no response,98,, ,2,0,0,98,,,no,no,don't know,,0,0,0,0,0,0,0,0,0,0,,,,,0,0,0,0,0,0,0,yes,0,0,, ,2,,, ,,,08 Aug 17,2,,0,0,0,0,housewife, ,not applicable, ,not applicable, ,private job, ,,0,,, , ,0,yes,no,no,no,no,housewife,,,,,,no,,,,0,98,no,,,,,,1,no,no,refused to answer,yes,slum,slum,,,,housewife/not working,no,no,Primary,6,no,illiterate or upto primary,housewife/notworking,97,.97,13.5,.9409,housewife,housewife or unskilled,no,no,,111627001,slum,yes,no,literate,yes,no,housewife/student,,,,no,no,yes,no,no,yes,no,,yes,4.5,3.5 years or older,3.5 or more,yes,no,male,yes,no,14.34796471463493,-.1659200747400831,no,no,yes,no,no,yes,no,no,yes,no,no,yes,,-.1659200747400831,-1 to +1,Selected,999,no response,111627001,111627001,08 Aug 17,08 Aug 17,9
2,0,,0,0,no,no,no,yes,1,0,0,,0,,2,,2,20,2,1,0, ,3,3,2,,3,30,1,1,15000, ,3,3,2,,4,18,1,1,5000, ,3,3,2,,5,25,1,1,8000,3,3,2,,,,,,,0,,,,,,,, ,,, ,0,,,,,,,, ,,,,0,,,,,,,, ,,, ,0,,,,,,,, ,,, ,0,,111626601,,,,,,,, ,0,,,,,,,,, ,0,,,,,,,,,,0,,,,,,,,,,0,,,,,,,,,,0,,,,,,,,0,,,,,,,,0,,,,,,,,0,,,,,,,,0,,,,,,,,0,,1, ,0,0,0,0,0,0,0, ,, ,2,,,,,0,0,0,0,0,0,,,,,,,,0,0,0,0,0,0,,,,,,,,0,0,0,0,0,0,,,,,111626601,3,,2,0,0,0,0,0,0, ,2,do not feel necessary,Proyojon ni,,97,0,0,0,0,0,0,0,0,1,Don't know,don't know,Don't know,, ,98,0,0,98,,,no,no response,yes,yes,0,0,0,0,0,0,0,0,0,0,,,,,0,0,0,0,0,0,0,yes,0,0,, ,2,,, ,,,07 Aug 17,2,,0,0,0,0,housewife, ,business, ,business, ,other unskilled worker,Dokan sohokari,,0,,, , ,0,yes,no,no,no,no,housewife,,,,,,no,,,,0,98,no,,,,,,1,no,no,refused to answer,yes,non-slum,non-slum,,,,housewife/not working,no,no,HSC and above,6,no,secondary and above,housewife/notworking,96,.96,12.6,.9216,housewife,housewife or unskilled,no,no,,111626601,non-slum,no,yes,literate,yes,no,housewife/student,,,,no,no,yes,no,no,yes,no,,yes,3,Less than 3.5 years old,1 to less than 3.5 years,no,yes,male,yes,no,13.671875,-.5738143603830721,no,no,yes,no,no,yes,no,no,yes,no,no,yes,,-.5738143603830721,-1 to +1,Selected,999,don't know,111626601,111626601,07 Aug 17,07 Aug 17,13
2,0,,0,0,no,yes,yes,yes,1,0,0,,0,,2,,2,14,2,1,0, ,3,3,2,,3,40,1,1,16000, ,3,3,2,,,,,,, ,,,2,,,,,,,,,0,,,,,,,0,,,,,,,, ,,, ,0,,,,,,,, ,,,,0,,,,,,,, ,,, ,0,,,,,,,, ,,, ,0,,111627101,,,,,,,, ,0,,,,,,,,, ,0,,,,,,,,,,0,,,,,,,,,,0,,,,,,,,,,0,,1,1,1,2,2,2,2,,,,,,,,0,,,,,,,,0,,,,,,,,0,,,,,,,,0,,3, ,0,0,0,0,0,0,0, ,, ,2,,,,,0,0,0,0,0,0,,,,,,,,0,0,0,0,0,0,,,,,,,,0,0,0,0,0,0,,,,,111627101,3,3,2,0,0,0,0,0,0, ,2,do not feel necessary,Dorkar ni,,97,0,0,0,0,0,0,0,1,0,0,no response,98,, ,98,0,0,97,,,no,no response,don't know,,0,0,0,0,0,0,0,0,0,0,,,,,0,0,0,0,0,0,0,yes,0,0,, ,2,,, ,,,08 Aug 17,2,,0,0,0,0,not applicable, ,politician,Politics,, ,, ,,0,,, , ,0,yes,no,no,no,no,,,,,,,no,,,,0,97,no,,,,,,1,no,no,refused to answer,yes,slum,slum,,,slum ill,,no,yes,Secondary,6,no,illiterate or upto primary,,92,.92,12.6,.8464,,,no,no,,111627101,slum,yes,no,literate,yes,no,,,,,,,,no,no,yes,no,,yes,4,3.5 years or older,3.5 or more,yes,no,female,no,yes,14.88657844990548,.1590330491279786,no,no,yes,yes,yes,no,no,no,yes,no,no,yes,,.1590330491279786,-1 to +1,Selected,999,local political leaders,111627101,111627101,08 Aug 17,08 Aug 17,11
4,1,2, ,Chachi,no,yes,no,no,1,0,0,,0,,2,,2,4.5,2,1,0, ,2,1,2,,3,4.5,1,1,0, ,2,1,2,,4,24,2,1,0, ,3,3,2,,5,34,1,1,15000,3,3,2,,6,30,1,1,15000,2,,7,32,1,1,16,5, ,15000,7, ,2,,8,27,2,1,16,8, ,0,8,,2,,9,24,2,1,16,8, ,0,8, ,2,,10,65,1,1,10,5, ,15000,6, ,2,,111625101,,,,,,,, ,0,,,,,,,,, ,0,,,,,,,,,,0,,,,,,,,,,0,,,,,,,,,,0,,1,1,1,2,2,2,2,,2,1,1,2,2,2,2,,3,1,1,2,2,2,2,,,,,,,,2,,,,,,,,2,,1,2.0,0,0,0,0,0,0,, ,,251,,,,,,0,0,0,0,0,0,0,,,2,,4,1,0,0,0,0,0,0,0,,,2,,,,0,0,0,0,0,0,0,,,2,,111625101,3,3,1,1,1,1,1,1,1,9.00am-12.00pm,do not feel necessary,Proyojon hobe na,,,,,,,,,,,, ,, ,, , ,97,,,,,no,yes,no,yes,yes,0,0,0,0,0,0,0,0,0,,,,0, ,0,yes,0,0,0,0,0,0,0,0, , ,,, ,,,,42949.63888888889,2,0,,no,,not applicable, ,not applicable, ,student,Student,business, ,business,1,,, ,5, ,no,no,yes,no,no,,,student,,,,yes-unpaid,2,,,,,,,2,,,,,no,no,no,,non-slum,non-slum,,,nonslum ill,housewife/not working,no,yes,HSC and above,6,yes-unpaid,secondary and above,housewife/notworking,98,.98,13.5,.9603999999999999,student,housewife or unskilled,no,no,,111625101,non-slum,no,yes,literate,yes,no,housewife/student,,,,no,no,yes,no,no,yes,no,,yes,4.5,3.5 years or older,3.5 or more,yes,no,female,no,yes,14.05664306538942,-.341678459225338,no,no,yes,yes,yes,no,yes,yes,no,no,no,no,no,-.341678459225338,-1 to +1,Selected,no,Ward councillor,111625101,111625101,02 Aug 17,02 Aug 17,29
2,0,2, , ,no,no,no,no,1,0,0,,0,,2,,2,45,2,1,0, ,3,3,2,,3,15,2,1,0,Khala,3,3,2,,4,18,1,1,10000, ,3,3,2,,5,23,1,1,14000,3,3,2,,6,60,1,1,12000,2,,,,,,,, ,,, ,0,,,,,,,, ,,,,0,,,,,,,, ,,, ,0,,,,,,,, ,,, ,0,,111320801,,,,,,,, ,0,,,,,,,,, ,0,,,,,,,,,,0,,,,,,,,,,0,,,,,,,,,,0,,1,1,1,2,1,2,2,,,,,,,,0,,,,,,,,0,,,,,,,,0,,,,,,,,0,,5, ,0,0,0,0,0,0,0, ,,208,,,,,,0,0,0,0,0,0,0,,,0,,,,0,0,0,0,0,0,0,,,0,,,,0,0,0,0,0,0,0,,,0,,111320801,3,3,0,0,0,0,0,0,0, ,do not feel necessary,Dorkar ni.baritei valo ase.,,,,,,,,,,,, ,, ,, , ,1,150,200,1,1,yes,no,yes,yes,yes,0,0,0,yes,0,0,0,0,0,,,,0, ,0,0,0,0,0,0,0,yes,0,0, ,Political leader,,, ,,,,42939.40972222222,2,0,,,,housewife, ,not applicable, ,tailor,Tailor,tailor,Tailor,business,2,,, , , ,yes,no,no,no,no,housewife,,,,,,no,,,,150,200,no,,,,,1,1,no,no,yes,yes,non-slum,non-slum,,,nonslum ill,housewife/not working,no,yes,Illiterate,3,no,,housewife/notworking,104,1.04,14.5,1.0816,housewife,housewife or unskilled,no,no,,111320801,non-slum,no,yes,illiterate,no,yes,housewife/student,,,,no,no,yes,no,no,yes,no,,yes,4.5,3.5 years or older,3.5 or more,yes,no,male,yes,no,13.40606508875739,-.7341811601082757,no,no,yes,yes,yes,no,no,no,yes,no,no,yes,yes,-.7341811601082757,-1 to +1,Selected,no,local political leaders,111320801,111320801,23 Jul 17,23 Jul 17,19
2,0,2, , ,no,no,no,no,1,0,0,,0,,2,,2,25,2,1,0, ,3,3,2,,3,28,1,1,25000, ,3,3,2,,4,11,2,1,0, ,3,3,2,,5,13,2,1,0,3,3,2,,6,24,1,1,20000,2,,,,,,,, ,,, ,0,,,,,,,, ,,,,0,,,,,,,, ,,, ,0,,,,,,,, ,,, ,0,,111324101,,,,,,,, ,0,,,,,,,,, ,0,,,,,,,,,,0,,,,,,,,,,0,,,,,,,,,,0,,1,1,1,2,2,2,2,,,,,,,,0,,,,,,,,0,,,,,,,,0,,,,,,,,0,,1, ,0,0,0,0,0,0,0, ,,241,,,,,,0,0,0,0,0,0,0,,,0,,,,0,0,0,0,0,0,0,,,0,,,,0,0,0,0,0,0,0,,,0,,111324101,3,97,0,0,0,0,0,0,0, ,do not feel necessary,Dorkar hoy na,,,,,,,,,,,, ,, ,, , , ,0,0,,1,yes,don't know,no,don't know,0,0,0,0,0,0,0,0,0,0,,,,0, ,0,0,0,0,0,0,0,yes,0,0, ,Political leader,,, ,,,,42947.51111111111,2,0,,,,housewife, ,business, ,not applicable, ,not applicable, ,business,2,,, , , ,yes,no,no,no,no,housewife,,,,,,no,,,,0,0,no,,,,,,,no,no,don't know,,non-slum,non-slum,,,nonslum ill,housewife/not working,no,yes,Secondary,3,no,illiterate or upto primary,housewife/notworking,87,.87,10.5,.7569,housewife,housewife or unskilled,no,no,,111324101,non-slum,no,yes,literate,yes,no,housewife/student,,,,no,no,yes,no,no,yes,no,,yes,2.5,Less than 3.5 years old,1 to less than 3.5 years,no,yes,female,no,yes,13.87237415774871,-.4528504425011202,no,no,yes,yes,yes,no,no,no,yes,no,no,no,,-.4528504425011202,-1 to +1,Selected,no,local political leaders,111324101,111324101,31 Jul 17,31 Jul 17,12
2,0,2, , ,no,no,no,,1,0,0,,0,,2,,2,27,2,1,0, ,3,3,2,,3,30,1,1,20000, ,3,3,2,,4,16,2,1,0,Fufu,3,3,2,,5,45,2,1,0,3,3,2,,,,,,,,,,,,,,, ,,, ,0,,,,,,,, ,,,,0,,,,,,,, ,,, ,0,,,,,,,, ,,, ,0,,111100401,,,,,,,, ,0,,,,,,,,, ,0,,,,,,,,,,0,,,,,,,,,,0,,,,,,,,,,0,,1,1,2,2,2,2,2,,,,,,,,0,,,,,,,,0,,,,,,,,0,,,,,,,,0,,1, ,0,0,0,0,0,0,0, ,,4,,,,,,0,0,0,0,0,0,0,,,0,,,,0,0,0,0,0,0,0,,,0,,,,0,0,0,0,0,0,0,,,0,,111100401,3,3,0,0,0,0,0,0,0, ,will enroll in madrasa/school,Shishur 5 Bocor hoye jabe,,,4,1,1,1,1,1,0,1,0,0,from morning till evening,9.00am -5.00pm,near home,1, ,1,400,500,1,1,yes,don't know,don't know,yes,yes,0,0,0,0,0,yes,0,0,0,,,,0, ,0,0,0,0,0,0,yes,0,0,0, , ,,, ,,,,42938.48472222222,2,0,,,,housewife, ,lives abroad,Probasi,student,Student,housewife, ,,2,,, , , ,yes,no,no,no,,housewife,,,,,,no,,,,400,500,no,,,,,1,1,no,no,don't know,yes,non-slum,non-slum,,,nonslum ill,housewife/not working,no,yes,Secondary,1,no,illiterate or upto primary,housewife/notworking,98,.98,13.1,.9603999999999999,housewife,housewife or unskilled,no,no,,111100401,non-slum,no,yes,literate,yes,no,housewife/student,,,,no,no,yes,no,no,yes,no,,yes,4.5,3.5 years or older,3.5 or more,yes,no,female,no,yes,13.64014993752603,-.5929545298231388,no,no,yes,yes,yes,no,no,no,yes,no,no,yes,,-.5929545298231388,-1 to +1,Selected,no,Ward councillor,111100401,111100401,22 Jul 17,22 Jul 17,22